X.org Setup

System Software

Source (link to git-repo or to original if based on someone elses unmodified work): Add the source-code for this project on opencode.net

0
Score 50.0%
Description:

The X.org Setup is a visual X.org 7.x setup utility that can detect video cards, monitors, etc.

It is capable of running from a console, even though it is written entirely in KDE/Qt.

It requires OpenSuSE's hwinfo and HAL/DBus support, and is part of the DARKSTAR Linux Project.

NOTE: The development of the X.org Setup is sponsored by the easys GNU/Linux, http://easys.gnulinux.de.
Last changelog:

12 years ago

The Xorg Setup is now part of ALICE (Advanced Linux Installation and Configuration Environment), the installation/configuration suite developed by the DARKSTAR team, for the Slackware based systems.

As application, the X.org Setup have more, more fixes and enhancements than previous version.

jeykey

12 years ago

I've the same Problem too. Using Kubuntu 7.0.4

Report

totoymola

12 years ago

Hello.

I tried installing this on my Kubuntu Feisty machine with kdebase-dev and libcurl3-dev, but I get this error during "make":

[code]
lanimation.cpp:24:26: error: qapplication.h: No such file or directory
lanimation.cpp:25:21: error: qbitmap.h: No such file or directory
lanimation.cpp:26:18: error: qdir.h: No such file or directory
lanimation.cpp:27:20: error: qimage.h: No such file or directory
lanimation.cpp:28:22: error: qpainter.h: No such file or directory
lanimation.cpp:29:23: error: qsettings.h: No such file or directory
In file included from lanimation.cpp:34:
lanimation.h:23:20: error: qtimer.h: No such file or directory
lanimation.h:24:21: error: qwidget.h: No such file or directory
In file included from lanimation.cpp:35:
lanimationimages.h:15:19: error: qdict.h: No such file or directory
lanimationimages.h:16:19: error: qmime.h: No such file or directory
lanimationimages.h:17:25: error: qdragobject.h: No such file or directory
In file included from lanimation.cpp:365:
lanimation.moc:12:25: error: qmetaobject.h: No such file or directory
lanimation.moc:15:34: error: private/qucomextra_p.h: No such file or directory
lanimation.moc:17:2: error: #error "This file was generated using the moc from 3.3.7. It"
lanimation.moc:18:2: error: #error "cannot be used with the include files from this version of Qt."
lanimation.moc:19:2: error: #error "(The moc has changed too much.)"
lanimation.h:34: error: expected class-name before '{' token
lanimation.h:35: error: ISO C++ forbids declaration of 'Q_OBJECT' with no type
lanimation.h:36: error: expected ';' before 'public'
lanimation.h:44: error: 'QResizeEvent' has not been declared
lanimation.h:46: error: expected `:' before 'slots'
lanimation.h:47: error: expected primary-expression before 'void'
lanimation.h:47: error: ISO C++ forbids declaration of 'slots' with no type
lanimation.h:47: error: expected ';' before 'void'
lanimation.h:54: error: 'QPixmap' does not name a type
lanimation.h:55: error: 'QPixmap' does not name a type
lanimation.h:57: error: 'QImage' does not name a type
lanimation.h:59: error: ISO C++ forbids declaration of 'QPtrList' with no type
lanimation.h:59: error: expected ';' before '<' token
lanimation.h:61: error: ISO C++ forbids declaration of 'QTimer' with no type
lanimation.h:61: error: expected ';' before '*' token
lanimationimages.h:16340: error: ISO C++ forbids declaration of 'QRgb' with no type
lanimationimages.h:16340: error: expected ';' before '*' token
lanimationimages.h:16344: error: 'FALSE' was not declared in this scope
lanimationimages.h:16345: error: 'FALSE' was not declared in this scope
lanimationimages.h:16347: error: too many initializers for 'EmbedImage'
lanimationimages.h:16347: error: too many initializers for 'EmbedImage'
lanimationimages.h:16347: error: too many initializers for 'EmbedImage'
lanimationimages.h:16349: error: 'QImage' does not name a type
lanimationimages.h:16374: error: expected class-name before '{' token
lanimationimages.h:16378: error: ISO C++ forbids declaration of 'QMimeSource' with no type
lanimationimages.h:16378: error: expected ';' before '*' token
lanimationimages.h:16388: error: expected initializer before '*' token
lanimationimages.h: In function 'void qInitImages_LAnimation()':
lanimationimages.h:16392: error: 'factory' was not declared in this scope
lanimationimages.h:16394: error: 'QMimeSourceFactory' has not been declared
lanimationimages.h: In function 'void qCleanupImages_LAnimation()':
lanimationimages.h:16400: error: 'factory' was not declared in this scope
lanimationimages.h:16401: error: 'QMimeSourceFactory' has not been declared
lanimationimages.h:16402: error: type '<type error>' argument given to 'delete', expected pointer
lanimation.cpp: At global scope:
lanimation.cpp:42: error: expected `)' before '*' token
lanimation.cpp:45: error: 'QPainter' has not been declared
lanimation.cpp:52: error: 'QPainter' has not been declared
lanimation.cpp:53: error: 'QPainter' has not been declared
lanimation.cpp:55: error: ISO C++ forbids declaration of 'QImage' with no type
lanimation.cpp:55: error: expected ';' before '*' token
lanimation.cpp:66: error: expected `)' before '*' token
lanimation.cpp: In destructor 'Star::~Star()':
lanimation.cpp:75: error: 'background' was not declared in this scope
lanimation.cpp: In member function 'void Star::restart()':
lanimation.cpp:80: error: 'background' was not declared in this scope
lanimation.cpp: At global scope:
lanimation.cpp:88: error: variable or field 'paint' declared void
lanimation.cpp:88: error: 'int Star::paint' is not a static member of 'class Star'
lanimation.cpp:88: error: 'QPainter' was not declared in this scope
lanimation.cpp:88: error: 'p' was not declared in this scope
lanimation.cpp:89: error: expected ',' or ';' before '{' token
lanimation.cpp:124: error: variable or field 'drawPoint' declared void
lanimation.cpp:124: error: 'int Star::drawPoint' is not a static member of 'class Star'
lanimation.cpp:124: error: 'QPainter' was not declared in this scope
lanimation.cpp:124: error: 'p' was not declared in this scope
lanimation.cpp:124: error: expected primary-expression before 'int'
lanimation.cpp:124: error: expected primary-expression before 'int'
lanimation.cpp:124: error: initializer expression list treated as compound expression
lanimation.cpp:125: error: expected ',' or ';' before '{' token
lanimation.cpp:134: error: variable or field 'clearPoint' declared void
lanimation.cpp:134: error: 'int Star::clearPoint' is not a static member of 'class Star'
lanimation.cpp:134: error: 'QPainter' was not declared in this scope
lanimation.cpp:134: error: 'p' was not declared in this scope
lanimation.cpp:134: error: expected primary-expression before 'int'
lanimation.cpp:134: error: expected primary-expression before 'int'
lanimation.cpp:134: error: initializer expression list treated as compound expression
lanimation.cpp:135: error: expected ',' or ';' before '{' token
lanimation.cpp:149: error: expected `)' before '*' token
lanimation.cpp:152: error: 'QPainter' has not been declared
lanimation.cpp:162: error: ISO C++ forbids declaration of 'QImage' with no type
lanimation.cpp:162: error: expected ';' before '*' token
lanimation.cpp:166: error: 'QBitmap' does not name a type
lanimation.cpp:167: error: 'QImage' does not name a type
lanimation.cpp:168: error: 'QImage' does not name a type
lanimation.cpp:169: error: 'QPixmap' does not name a type
lanimation.cpp:171: error: ISO C++ forbids declaration of 'QPtrList' with no type
lanimation.cpp:171: error: expected ';' before '<' token
lanimation.cpp: In destructor 'virtual Planet::~Planet()':
lanimation.cpp:176: error: 'background' was not declared in this scope
lanimation.cpp: At global scope:
lanimation.cpp:179: error: expected `)' before '*' token
lanimation.cpp:227: error: variable or field 'paint' declared void
lanimation.cpp:227: error: 'int Planet::paint' is not a static member of 'class Planet'
lanimation.cpp:227: error: 'QPainter' was not declared in this scope
lanimation.cpp:227: error: 'p' was not declared in this scope
lanimation.cpp:228: error: expected ',' or ';' before '{' token
lanimation.cpp:261: error: expected `)' before '*' token
lanimation.cpp: In member function 'void LAnimation::restart()':
lanimation.cpp:286: error: 'width' was not declared in this scope
lanimation.cpp:287: error: 'height' was not declared in this scope
lanimation.cpp:289: error: 'starground' was not declared in this scope
lanimation.cpp:290: error: 'workground' was not declared in this scope
lanimation.cpp:292: error: 'background' was not declared in this scope
lanimation.cpp:294: error: 'black' was not declared in this scope
lanimation.cpp:296: error: 'NoBackground' was not declared in this scope
lanimation.cpp:296: error: 'setBackgroundMode' was not declared in this scope
lanimation.cpp:309: error: 'stars' was not declared in this scope
lanimation.cpp:321: error: 'QWMatrix' was not declared in this scope
lanimation.cpp:321: error: expected `;' before 'matrix'
lanimation.cpp:323: error: 'QImage' was not declared in this scope
lanimation.cpp:323: error: expected `;' before 'galaxy'
lanimation.cpp:325: error: 'galaxy' was not declared in this scope
lanimation.cpp:325: error: 'matrix' was not declared in this scope
lanimation.cpp:330: error: 'bitBlt' was not declared in this scope
lanimation.cpp:333: error: 'update' was not declared in this scope
lanimation.cpp: At global scope:
lanimation.cpp:336: error: variable or field 'resizeEvent' declared void
lanimation.cpp:336: error: 'int LAnimation::resizeEvent' is not a static member of 'class LAnimation'
lanimation.cpp:336: error: 'QResizeEvent' was not declared in this scope
lanimation.cpp:336: error: 'e' was not declared in this scope
lanimation.cpp:337: error: expected ',' or ';' before '{' token
lanimation.cpp:341: error: no 'void LAnimation::slotTimeout()' member function declared in class 'LAnimation'
lanimation.cpp: In member function 'void LAnimation::slotTimeout()':
lanimation.cpp:343: error: 'QPainter' was not declared in this scope
lanimation.cpp:343: error: expected `;' before 'p'
lanimation.cpp:345: error: 'stars' was not declared in this scope
lanimation.cpp:347: error: 'p' was not declared in this scope
lanimation.cpp:350: error: 'p' was not declared in this scope
lanimation.cpp:352: error: 'workground' was not declared in this scope
lanimation.cpp:352: error: 'starground' was not declared in this scope
lanimation.cpp:352: error: 'bitBlt' was not declared in this scope
lanimation.moc: At global scope:
lanimation.moc:22: error: no 'const char* LAnimation::className() const' member function declared in class 'LAnimation'
lanimation.moc:27: error: expected constructor, destructor, or type conversion before '*' token
lanimation.moc:28: error: 'QMetaObjectCleanUp' does not name a type
lanimation.moc:31: error: 'QString' does not name a type
lanimation.moc:39: error: 'QString' does not name a type
lanimation.moc:50: error: expected constructor, destructor, or type conversion before '*' token
lanimation.moc:72: error: no 'void* LAnimation::qt_cast(const char*)' member function declared in class 'LAnimation'
lanimation.moc: In member function 'void* LAnimation::qt_cast(const char*)':
lanimation.moc:74: error: 'qstrcmp' was not declared in this scope
lanimation.moc:76: error: 'QWidget' has not been declared
lanimation.moc: At global scope:
lanimation.moc:79: error: 'QUObject' has not been declared
lanimation.moc:79: error: no 'bool LAnimation::qt_invoke(int, int*)' member function declared in class 'LAnimation'
lanimation.moc: In member function 'bool LAnimation::qt_invoke(int, int*)':
lanimation.moc:81: error: 'staticMetaObject' was not declared in this scope
lanimation.moc:84: error: 'QWidget' has not been declared
lanimation.moc:86: error: 'TRUE' was not declared in this scope
lanimation.moc: At global scope:
lanimation.moc:89: error: 'QUObject' has not been declared
lanimation.moc:89: error: no 'bool LAnimation::qt_emit(int, int*)' member function declared in class 'LAnimation'
lanimation.moc: In member function 'bool LAnimation::qt_emit(int, int*)':
lanimation.moc:91: error: 'QWidget' has not been declared
lanimation.moc: At global scope:
lanimation.moc:95: error: 'QVariant' has not been declared
lanimation.moc:95: error: no 'bool LAnimation::qt_property(int, int, int*)' member function declared in class 'LAnimation'
lanimation.moc: In member function 'bool LAnimation::qt_property(int, int, int*)':
lanimation.moc:97: error: 'QWidget' has not been declared
lanimation.moc: At global scope:
lanimation.moc:100: error: 'bool LAnimation::qt_static_property' is not a static member of 'class LAnimation'
lanimation.moc:100: error: 'QObject' was not declared in this scope
lanimation.moc:100: error: expected primary-expression before ',' token
lanimation.moc:100: error: expected primary-expression before 'int'
lanimation.moc:100: error: expected primary-expression before 'int'
lanimation.moc:100: error: 'QVariant' was not declared in this scope
lanimation.moc:100: error: expected primary-expression before ')' token
lanimation.moc:100: error: initializer expression list treated as compound expression
lanimation.moc:100: error: expected ',' or ';' before '{' token
lanimationimages.h:16343: warning: 'embed_image_vec' defined but not used
make[4]: *** [lanimation.lo] Error 1
make[4]: Leaving directory `/home/james/Desktop/xorgsetup-0.9.2/src/lib/setupcore'
make[3]: *** [all-recursive] Error 1
make[3]: Leaving directory `/home/james/Desktop/xorgsetup-0.9.2/src/lib'
make[2]: *** [all-recursive] Error 1
make[2]: Leaving directory `/home/james/Desktop/xorgsetup-0.9.2/src'
make[1]: *** [all-recursive] Error 1
make[1]: Leaving directory `/home/james/Desktop/xorgsetup-0.9.2'
make: *** [all] Error 2
[/code]

Report

szamrok

12 years ago

I've the same problem, using Arch current.

Report

zxc232

12 years ago

I configure X.org Setup on Kubuntu 6.10. After installing xlib and Qt3.3, I've got message:
checking for KDE... configure: error:
in the prefix, you've chosen, are no KDE headers installed. This will fail.
So, check this please and use another prefix!

Please help!

Report

nethad

12 years ago

You need kdebase-dev

Report

jeykey

12 years ago

There is just another error:
checking for Qt... configure: error: Qt (>= Qt 3.2 and < 4.0) (headers and libraries) not found. Please check your installation!
For more details about this problem, look at the end of config.log.

Which package should I install?

Report

C

darkstarlinuxro

12 years ago

Mister nethad, another opinion?

Report

jackiebrown

12 years ago

kdebase-dev should give you all the qt, kde, and xorg stuff you need.

Report

jeykey

12 years ago

thx

Report

jeykey

12 years ago

checking for X... configure: error: Can't find X libraries. Please check your installation and add the correct paths!

What can I do? Which package needs to be installed?

I use Kubuntu 7.0.4 with kde 3.5.6

Report

nethad

12 years ago

You need the X-devel packages.

sudo aptitude install xorg-dev xserver-xorg-dev

Report

C

darkstarlinuxro

12 years ago

Sorry! I not use the Ubuntu...

Please, consult a Ubuntu support forum, for installing the KDE "development" packages!

Supplementary, the OpenSuSE's hwinfo is required... But, I seem this port on Ubuntu...

Report

nethad

12 years ago

Hi,

I wanted to compile your source. ./configure does not give any error.

make[4]: Betrete Verzeichnis '/home/thomas/transfer/xorgsetup-0.9.2/src/lib/setupcore'
if /bin/bash ../../../libtool --silent --tag=CXX --mode=compile g++ -DHAVE_CONFIG_H -I. -I. -I../../.. -DQT_THREAD_SUPPORT -D_REENTRANT -Wno-long-long -Wundef -ansi -D_XOPEN_SOURCE=500 -D_BSD_SOURCE -Wcast-align -Wconversion -Wchar-subscripts -Wall -W -Wpointer-arith -O2 -Wformat-security -Wmissing-format-attribute -Wno-non-virtual-dtor -fno-exceptions -fno-check-new -fno-common -fexceptions -MT lanimation.lo -MD -MP -MF ".deps/lanimation.Tpo" -c -o lanimation.lo lanimation.cpp; \
then mv -f ".deps/lanimation.Tpo" ".deps/lanimation.Plo"; else rm -f ".deps/lanimation.Tpo"; exit 1; fi
lanimation.cpp:24:26: error: qapplication.h: No such file or directory
lanimation.cpp:25:21: error: qbitmap.h: No such file or directory
lanimation.cpp:26:18: error: qdir.h: No such file or directory
lanimation.cpp:27:20: error: qimage.h: No such file or directory
lanimation.cpp:28:22: error: qpainter.h: No such file or directory
lanimation.cpp:29:23: error: qsettings.h: No such file or directory
In file included from lanimation.cpp:34:
lanimation.h:23:20: error: qtimer.h: No such file or directory
lanimation.h:24:21: error: qwidget.h: No such file or directory
In file included from lanimation.cpp:35:
lanimationimages.h:15:19: error: qdict.h: No such file or directory
lanimationimages.h:16:19: error: qmime.h: No such file or directory
lanimationimages.h:17:25: error: qdragobject.h: No such file or directory
In file included from lanimation.cpp:365:
lanimation.moc:12:25: error: qmetaobject.h: No such file or directory
lanimation.moc:15:34: error: private/qucomextra_p.h: No such file or directory
lanimation.moc:17:2: error: #error "This file was generated using the moc from 3.3.7. It"
lanimation.moc:18:2: error: #error "cannot be used with the include files from this version of Qt."
lanimation.moc:19:2: error: #error "(The moc has changed too much.)"
lanimation.h:34: error: expected class-name before '{' token
lanimation.h:35: error: ISO C++ forbids declaration of 'Q_OBJECT' with no type
lanimation.h:36: error: expected ';' before 'public'
lanimation.h:44: error: 'QResizeEvent' has not been declared
lanimation.h:46: error: expected `:' before 'slots'
lanimation.h:47: error: expected primary-expression before 'void'
lanimation.h:47: error: ISO C++ forbids declaration of 'slots' with no type
lanimation.h:47: error: expected ';' before 'void'
lanimation.h:54: error: 'QPixmap' does not name a type
lanimation.h:55: error: 'QPixmap' does not name a type
lanimation.h:57: error: 'QImage' does not name a type
lanimation.h:59: error: ISO C++ forbids declaration of 'QPtrList' with no type
lanimation.h:59: error: expected ';' before '<' token
lanimation.h:61: error: ISO C++ forbids declaration of 'QTimer' with no type
lanimation.h:61: error: expected ';' before '*' token
lanimationimages.h:16340: error: ISO C++ forbids declaration of 'QRgb' with no type
lanimationimages.h:16340: error: expected ';' before '*' token
lanimationimages.h:16344: error: 'FALSE' was not declared in this scope
lanimationimages.h:16345: error: 'FALSE' was not declared in this scope
lanimationimages.h:16347: error: too many initializers for 'EmbedImage'
lanimationimages.h:16347: error: too many initializers for 'EmbedImage'
lanimationimages.h:16347: error: too many initializers for 'EmbedImage'
lanimationimages.h:16349: error: 'QImage' does not name a type
lanimationimages.h:16374: error: expected class-name before '{' token
lanimationimages.h:16378: error: ISO C++ forbids declaration of 'QMimeSource' with no type
lanimationimages.h:16378: error: expected ';' before '*' token
lanimationimages.h:16388: error: expected initializer before '*' token
lanimationimages.h: In function 'void qInitImages_LAnimation()':
lanimationimages.h:16392: error: 'factory' was not declared in this scope
lanimationimages.h:16394: error: 'QMimeSourceFactory' has not been declared
lanimationimages.h: In function 'void qCleanupImages_LAnimation()':
lanimationimages.h:16400: error: 'factory' was not declared in this scope
lanimationimages.h:16401: error: 'QMimeSourceFactory' has not been declared
lanimationimages.h:16402: error: type '<type error>' argument given to 'delete', expected pointer
lanimation.cpp: At global scope:
lanimation.cpp:42: error: expected `)' before '*' token
lanimation.cpp:45: error: 'QPainter' has not been declared
lanimation.cpp:52: error: 'QPainter' has not been declared
lanimation.cpp:53: error: 'QPainter' has not been declared
lanimation.cpp:55: error: ISO C++ forbids declaration of 'QImage' with no type
lanimation.cpp:55: error: expected ';' before '*' token
lanimation.cpp:66: error: expected `)' before '*' token
lanimation.cpp: In destructor 'Star::~Star()':
lanimation.cpp:75: error: 'background' was not declared in this scope
lanimation.cpp: In member function 'void Star::restart()':
lanimation.cpp:80: error: 'background' was not declared in this scope
lanimation.cpp: At global scope:
lanimation.cpp:88: error: variable or field 'paint' declared void
lanimation.cpp:88: error: 'int Star::paint' is not a static member of 'class Star'
lanimation.cpp:88: error: 'QPainter' was not declared in this scope
lanimation.cpp:88: error: 'p' was not declared in this scope
lanimation.cpp:89: error: expected ',' or ';' before '{' token
lanimation.cpp:124: error: variable or field 'drawPoint' declared void
lanimation.cpp:124: error: 'int Star::drawPoint' is not a static member of 'class Star'
lanimation.cpp:124: error: 'QPainter' was not declared in this scope
lanimation.cpp:124: error: 'p' was not declared in this scope
lanimation.cpp:124: error: expected primary-expression before 'int'
lanimation.cpp:124: error: expected primary-expression before 'int'
lanimation.cpp:124: error: initializer expression list treated as compound expression
lanimation.cpp:125: error: expected ',' or ';' before '{' token
lanimation.cpp:134: error: variable or field 'clearPoint' declared void
lanimation.cpp:134: error: 'int Star::clearPoint' is not a static member of 'class Star'
lanimation.cpp:134: error: 'QPainter' was not declared in this scope
lanimation.cpp:134: error: 'p' was not declared in this scope
lanimation.cpp:134: error: expected primary-expression before 'int'
lanimation.cpp:134: error: expected primary-expression before 'int'
lanimation.cpp:134: error: initializer expression list treated as compound expression
lanimation.cpp:135: error: expected ',' or ';' before '{' token
lanimation.cpp:149: error: expected `)' before '*' token
lanimation.cpp:152: error: 'QPainter' has not been declared
lanimation.cpp:162: error: ISO C++ forbids declaration of 'QImage' with no type
lanimation.cpp:162: error: expected ';' before '*' token
lanimation.cpp:166: error: 'QBitmap' does not name a type
lanimation.cpp:167: error: 'QImage' does not name a type
lanimation.cpp:168: error: 'QImage' does not name a type
lanimation.cpp:169: error: 'QPixmap' does not name a type
lanimation.cpp:171: error: ISO C++ forbids declaration of 'QPtrList' with no type
lanimation.cpp:171: error: expected ';' before '<' token
lanimation.cpp: In destructor 'virtual Planet::~Planet()':
lanimation.cpp:176: error: 'background' was not declared in this scope
lanimation.cpp: At global scope:
lanimation.cpp:179: error: expected `)' before '*' token
lanimation.cpp:227: error: variable or field 'paint' declared void
lanimation.cpp:227: error: 'int Planet::paint' is not a static member of 'class Planet'
lanimation.cpp:227: error: 'QPainter' was not declared in this scope
lanimation.cpp:227: error: 'p' was not declared in this scope
lanimation.cpp:228: error: expected ',' or ';' before '{' token
lanimation.cpp:261: error: expected `)' before '*' token
lanimation.cpp: In member function 'void LAnimation::restart()':
lanimation.cpp:286: error: 'width' was not declared in this scope
lanimation.cpp:287: error: 'height' was not declared in this scope
lanimation.cpp:289: error: 'starground' was not declared in this scope
lanimation.cpp:290: error: 'workground' was not declared in this scope
lanimation.cpp:292: error: 'background' was not declared in this scope
lanimation.cpp:294: error: 'black' was not declared in this scope
lanimation.cpp:296: error: 'NoBackground' was not declared in this scope
lanimation.cpp:296: error: 'setBackgroundMode' was not declared in this scope
lanimation.cpp:309: error: 'stars' was not declared in this scope
lanimation.cpp:321: error: 'QWMatrix' was not declared in this scope
lanimation.cpp:321: error: expected `;' before 'matrix'
lanimation.cpp:323: error: 'QImage' was not declared in this scope
lanimation.cpp:323: error: expected `;' before 'galaxy'
lanimation.cpp:325: error: 'galaxy' was not declared in this scope
lanimation.cpp:325: error: 'matrix' was not declared in this scope
lanimation.cpp:330: error: 'bitBlt' was not declared in this scope
lanimation.cpp:333: error: 'update' was not declared in this scope
lanimation.cpp: At global scope:
lanimation.cpp:336: error: variable or field 'resizeEvent' declared void
lanimation.cpp:336: error: 'int LAnimation::resizeEvent' is not a static member of 'class LAnimation'
lanimation.cpp:336: error: 'QResizeEvent' was not declared in this scope
lanimation.cpp:336: error: 'e' was not declared in this scope
lanimation.cpp:337: error: expected ',' or ';' before '{' token
lanimation.cpp:341: error: no 'void LAnimation::slotTimeout()' member function declared in class 'LAnimation'
lanimation.cpp: In member function 'void LAnimation::slotTimeout()':
lanimation.cpp:343: error: 'QPainter' was not declared in this scope
lanimation.cpp:343: error: expected `;' before 'p'
lanimation.cpp:345: error: 'stars' was not declared in this scope
lanimation.cpp:347: error: 'p' was not declared in this scope
lanimation.cpp:350: error: 'p' was not declared in this scope
lanimation.cpp:352: error: 'workground' was not declared in this scope
lanimation.cpp:352: error: 'starground' was not declared in this scope
lanimation.cpp:352: error: 'bitBlt' was not declared in this scope
lanimation.moc: At global scope:
lanimation.moc:22: error: no 'const char* LAnimation::className() const' member function declared in class 'LAnimation'
lanimation.moc:27: error: expected constructor, destructor, or type conversion before '*' token
lanimation.moc:28: error: 'QMetaObjectCleanUp' does not name a type
lanimation.moc:31: error: 'QString' does not name a type
lanimation.moc:39: error: 'QString' does not name a type
lanimation.moc:50: error: expected constructor, destructor, or type conversion before '*' token
lanimation.moc:72: error: no 'void* LAnimation::qt_cast(const char*)' member function declared in class 'LAnimation'
lanimation.moc: In member function 'void* LAnimation::qt_cast(const char*)':
lanimation.moc:74: error: 'qstrcmp' was not declared in this scope
lanimation.moc:76: error: 'QWidget' has not been declared
lanimation.moc: At global scope:
lanimation.moc:79: error: 'QUObject' has not been declared
lanimation.moc:79: error: no 'bool LAnimation::qt_invoke(int, int*)' member function declared in class 'LAnimation'
lanimation.moc: In member function 'bool LAnimation::qt_invoke(int, int*)':
lanimation.moc:81: error: 'staticMetaObject' was not declared in this scope
lanimation.moc:84: error: 'QWidget' has not been declared
lanimation.moc:86: error: 'TRUE' was not declared in this scope
lanimation.moc: At global scope:
lanimation.moc:89: error: 'QUObject' has not been declared
lanimation.moc:89: error: no 'bool LAnimation::qt_emit(int, int*)' member function declared in class 'LAnimation'
lanimation.moc: In member function 'bool LAnimation::qt_emit(int, int*)':
lanimation.moc:91: error: 'QWidget' has not been declared
lanimation.moc: At global scope:
lanimation.moc:95: error: 'QVariant' has not been declared
lanimation.moc:95: error: no 'bool LAnimation::qt_property(int, int, int*)' member function declared in class 'LAnimation'
lanimation.moc: In member function 'bool LAnimation::qt_property(int, int, int*)':
lanimation.moc:97: error: 'QWidget' has not been declared
lanimation.moc: At global scope:
lanimation.moc:100: error: 'bool LAnimation::qt_static_property' is not a static member of 'class LAnimation'
lanimation.moc:100: error: 'QObject' was not declared in this scope
lanimation.moc:100: error: expected primary-expression before ',' token
lanimation.moc:100: error: expected primary-expression before 'int'
lanimation.moc:100: error: expected primary-expression before 'int'
lanimation.moc:100: error: 'QVariant' was not declared in this scope
lanimation.moc:100: error: expected primary-expression before ')' token
lanimation.moc:100: error: initializer expression list treated as compound expression
lanimation.moc:100: error: expected ',' or ';' before '{' token
lanimationimages.h:16343: warning: 'embed_image_vec' defined but not used
make[4]: *** [lanimation.lo] Fehler 1
make[4]: Verlasse Verzeichnis '/home/thomas/transfer/xorgsetup-0.9.2/src/lib/setupcore'
make[3]: *** [all-recursive] Fehler 1
make[3]: Verlasse Verzeichnis '/home/thomas/transfer/xorgsetup-0.9.2/src/lib'
make[2]: *** [all-recursive] Fehler 1
make[2]: Verlasse Verzeichnis '/home/thomas/transfer/xorgsetup-0.9.2/src'
make[1]: *** [all-recursive] Fehler 1
make[1]: Verlasse Verzeichnis '/home/thomas/transfer/xorgsetup-0.9.2'
make: *** [all] Fehler 2

"Fehler" means "Error". I don't know what this could be, I have installed several libqt* packages.

Report

C

darkstarlinuxro

12 years ago

This means as some environment mistakes...

Please, specify the distribution, gcc version and bare KDE and Qt version...

Report

jackiebrown

12 years ago

I get the exact same error on my Debian Sid box

Gcc: 4.1.2
KDE: 3.5.6
Qt: 3.3.3.7

I sent you the config.log

Report

nethad

12 years ago

Thank you for your quick response.

Distro: Kubuntu 7.04
gcc: 4.1.2
KDE: 3.5.6
Qt: 3.3.7 or 3.3.8
(Version: 3:3.3.8really3.3.7-0ubuntu5)
I think this is a patched 3.3.7

Report

C

darkstarlinuxro

12 years ago

Seems like the used versions for development...

On the Debian like systems, the separately "devel" packages is required for aplications building...

Is this "devel" packages installed?

Report

nethad

12 years ago

The devel-packages are all installed. I think there should be a message when I run ./configure. It looks like there are some qt libraries missing, but i don't know which ones. I think I have all necessary installed.

Report

C

darkstarlinuxro

12 years ago

1st time compiling fixes:

The compiler can't find the Qt headers...

Use this command, before compile:
export CPLUS_INCLUDE_PATH=$QTDIR/include:$CPLUS_INCLUDE_PATH

On the Slackware like systems ( used for X.org Setup development ), this is done automatically...

I work on a Ubuntu fixed new version, but, this is a emergency sollution...

Report

jackiebrown

12 years ago

That did not fix it for me. Ame error.

Report

C

darkstarlinuxro

12 years ago

A idea!

Extract the tarball in to new ( and empty ) directory...

Create a directory "build" in the source tree...

Run "../configure"

Send my at wwww.darkstarlinux.ro/contact , the "configure.log", if have build problems...

Thanks...

Report

C

darkstarlinuxro

12 years ago

the application is written from scratch and can be runned from console mode too( i mean not inside , u run xorgsetup and u get what the screenshots are showing) :D

Report

suslik

12 years ago

Neat stuff. The 1st two screens look like the prompts I get while running the sax2 X setup util on Suse...

Me wonders if this app is a next step from there...

Report

12 years ago

The Xorg Setup is now part of ALICE (Advanced Linux Installation and Configuration Environment), the installation/configuration suite developed by the DARKSTAR team, for the Slackware based systems.

As application, the X.org Setup have more, more fixes and enhancements than previous version.

12345678910
product-maker Count: 4 Rating: 5.0
File (click to download) Version Description PackagetypeArchitectureRelease Channel Downloads Date Filesize DL OCS-Install
Pling
*Needs ocs-url or ocs-store to install things
Details
license
version
0.9.7
updated Nov 20 2007
added Apr 26 2007
downloads 24h
0
page views 24h 4
System Tags app software